{"text_format":"1","workbook":"xlsx","n_sheets":14,"sheets":["FILL OUT FIRST - TOC","LEMA Eligibilty","FRINGE BENEFITS","LABOR","LEMA EQUIPMENT","RA EQUIPMENT","FEMA EQUIP.RATES","LEMA PER DIEM RATES","LEMA MATERIALS","RA MATERIALS","COST SUMMARY ROLL-UP","LEMA INVOICE","RA INVOICE","List Selections"],"not_rendered":{"charts":0,"images":8,"macros":0,"external_links":1,"defined_names":59,"comments":4,"pivot_tables":0},"unopened":[],"bounds":{"document_bytes":16777216,"sheet_cells":100000,"rows_first":2000,"rows_last":500,"rows_between":2000,"halvings":0,"cell_chars":16384,"cell_head_chars":4096},"cells_cut":0,"cells_raw":0,"read":"whole","date_system":"1900"}

{"sheet":"FILL OUT FIRST - TOC","index":0,"n_rows":21,"n_cols":6,"rows_kept":21,"cut":false,"hidden":false,"merged":[[2,1,2,2],[2,4,2,5],[0,4,1,4],[3,3,6,3],[7,3,17,3],[11,1,11,2],[6,4,6,5],[11,4,12,4]]}
[]
[]
[null,"TABLE OF CONTENTS\nCheck the box if included in PW package\nClick on title to link to sheet",null,null,"FILL OUT FIRST"]
[null,null,"Fringe Benefits","DISASTER \nDETAILS","Disaster Number (XXXX-DR-STATE):"]
[null,null,"Labor",null,"Applicant Name:"]
[null,null,"Equipment",null,"Category:","Law Enforcement Mutual Aid"]
[null,null,"Materials"]
[null,null,"Cost Summary Roll-Up","Agency Information","Prepared By:"," "]
[null,null,"Invoice",null,"Preparer Title:"," "]
[null,null,null,null,"Department:"," "]
{"$rows_left_out":12}
{"sheet":"LEMA Eligibilty","index":1,"n_rows":68,"n_cols":2,"rows_kept":68,"cut":false,"hidden":false,"merged":[]}
[]
[]
[]
[null,"CalOES - Law Enforcement Mutual Aid Assistance (LEMA) Program"]
[]
[null,"Eligibility For Reimbursement"]
[]
[null,"In order to be eligible for reimbursement the resource must have been requested and not self deployed. The reimbursement period starts after the first 12 hours. All back up documentation must be provided. Depending on the Type of Mutual Aid Provided the expenses incurred may vary."]
[]
[]
{"$rows_left_out":59}
{"sheet":"FRINGE BENEFITS","index":2,"n_rows":63,"n_cols":10,"rows_kept":63,"cut":false,"hidden":false,"merged":[[52,2,53,4],[12,6,12,7],[20,6,20,7],[22,6,22,7],[23,9,23,10],[38,1,38,10],[49,2,50,9],[37,4,37,5],[40,1,44,11],[46,1,47,10],[37,6,37,7],[37,9,37,10],[28,9,28,10],[34,9,34,10],[34,6,34,7],[24,6,24,7],[4,9,4,11],[3,9,3,11],[4,7,4,8],[3,7,3,8],[3,1,3,6],[4,1,4,6],[26,9,26,10],[9,5,9,8],[12,9,12,10],[20,9,20,10],[21,9,21,10],[0,1,0,9],[6,13,6,15],[7,5,7,8],[32,6,32,7],[30,6,30,7],[14,6,14,7],[16,6,16,7],[18,6,18,7],[28,6,28,7],[22,9,22,10],[26,6,26,7],[27,9,27,10],[24,9,24,10],[25,9,25,10],[1,1,1,11],[2,1,2,11]]}
[null,"CalOES - Law Enforcement Mutual Aid Assistance (LEMA) Program"]
[null," "]
[null,"APPLICANT'S BENEFITS CALCULATION WORKSHEET"]
[null,"APPLICANT",null,null,null,null,null,"CATEGORY",null,{"$f":"'FILL OUT FIRST - TOC'!E4","v":"Disaster Number (XXXX-DR-STATE):"}]
[null,{"$f":"'FILL OUT FIRST - TOC'!$F$5","v":0},null,null,null,null,null,{"$f":"'FILL OUT FIRST - TOC'!$F$6","v":"Law Enforcement Mutual Aid"},null,{"$f":"'FILL OUT FIRST - TOC'!$F$4","v":0}]
[]
[]
[null,null,null,null,null,"ENTER TOTAL ANNUAL PAYROLL"]
[]
[]
{"$rows_left_out":54}
{"sheet":"LABOR","index":3,"n_rows":41,"n_cols":54,"rows_kept":41,"cut":false,"hidden":false,"merged":[[2,1,2,30],[4,19,4,25],[3,19,3,25],[4,16,4,18],[3,16,3,18],[3,1,3,15],[4,1,4,15],[9,30,10,30],[4,26,4,29],[8,23,10,23],[8,24,10,24],[8,25,10,25],[8,26,8,30],[9,26,10,26],[1,1,1,30],[9,29,10,29],[8,21,10,21],[8,22,10,22],[9,27,10,27],[8,9,10,9],[8,7,10,7],[8,11,10,11],[5,1,10,2],[9,28,10,28],[8,17,10,17],[8,18,10,18],[3,26,3,29],[5,5,7,25],[5,4,10,4],[5,3,10,3],[8,10,10,10],[8,19,10,19],[8,20,10,20],[8,16,10,16],[8,5,10,5],[8,12,10,12],[8,13,10,13],[8,14,10,14],[8,15,10,15],[8,6,10,6],[8,8,10,8]]}
[]
[null,"CalOES - Law Enforcement Mutual Aid Assistance (LEMA) Program "]
[null,"FORCE ACCOUNT LABOR RECORD",null,null,null,null,null,null,null,null,null,null,null,null,null,null,null,null,null,null,null,null,null,null,null,null,null,null,null,null,null,null,null,"FT","Yes"]
[null,"APPLICANT",null,null,null,null,null,null,null,null,null,null,null,null,null,null,"CATEGORY",null,null,{"$f":"'FILL OUT FIRST - TOC'!E4","v":"Disaster Number (XXXX-DR-STATE):"},null,null,null,null,null,null,"After review of the pay policy, are EXEMPT employees eligible for OT?",null,null,null,"No",null,null,"PT","No"]
[null,{"$f":"'FILL OUT FIRST - TOC'!$F$5","v":0},null,null,null,null,null,null,null,null,null,null,null,null,null,null,{"$f":"'FILL OUT FIRST - TOC'!$F$6","v":"Law Enforcement Mutual Aid"},null,null,{"$f":"'FILL OUT FIRST - TOC'!$F$4","v":0},null,null,null,null,null,null,"Enter OT Rate",null,null,null,1.5,null,null,"T",null,null,null,null,null,null,null,null,null,null,null,null,null,null,null,null,null,null,null,{"$f":"IF(ISBLANK(BB4),\"\",VLOOKUP(BB4,#REF!,2,0))","v":""}]
[null,"EMPLOYEE NAME / TITLE",null,"STATUS","REG / OT","    DATES & HOURS WORKED EACH WEEK",null,null,null,null,null,null,null,null,null,null,null,null,null,null,null,null,null,null,null,null,{"$f":"SUM($AA$12,$AA$14,$AA$16,$AA$18,$AA$20,$AA$22,$AA$24,$AA$26,$AA$28,$AA$30,$AA$32,$AA$42,$AA$44,$AA$46,$AA$48,$AA$50,$AA$52,$AA$54,$AA$56,$AA$58,$AA$60,$AA$62,$AA$64,$AA$66,$AA$68,$AA$70,$AA$72,$AA$74,$AA$76,$AA$78,$AA$80,$AA$82,$AA$84,$AA$86,$AA$88,$AA$90,$AA$92,$AA$94,$AA$96,$AA$98,$AA$100,$AA$102,$AA$104,$AA$106,$AA$108,$AA$110,$AA$112,$AA$114,$AA$116,$AA$118,$AA$120,$AA$122,$AA$124,$AA$126,$AA$128,$AA$130,$AA$132,$AA$134,$AA$136,$AA$138,$AA$140,$AA$142,$AA$144,$AA$146,$AA$148,$AA$150,$AA$152,$AA$154,$AA$156,$AA$158,$AA$160,$AA$162,$AA$164,$AA$166,$AA$168,$AA$170,$AA$172,$AA$174,$AA$176,$AA$178,$AA$180,$AA$182,$AA$184,$AA$186,$AA$188,$AA$190,$AA$192,$AA$194,$AA$196,$AA$198,$AA$200,$AA$202,$AA$204,$AA$206,$AA$208,$AA$210,$AA$212,$AA$214,$AA$216,$AA$218,$AA$220,$AA$222,$AA$224,$AA$226,$AA$228,$AA$230,$AA$232,$AA$234,$AA$236,$AA$238,$AA$240,$AA$242,$AA$244,$AA$246,$AA$248,$AA$250,$AA$252,$AA$254,$AA$256,$AA$258,$AA$260,$AA$262,$AA$264,$AA$266,$AA$268,$AA$270,$AA$272,$AA$274,$AA$276,$AA$278,$AA$280,$AA$282,$AA$284,$AA$286,$AA$288,$AA$290,$AA$292,$AA$294,$AA$296,$AA$298,$AA$300,$AA$302,$AA$304,$AA$306,$AA$308,$AA$310,$AA$312,$AA$314,$AA$316,$AA$318,$AA$320,$AA$322,$AA$324,$AA$326,$AA$328,$AA$330,$AA$332,$AA$334,$AA$336,$AA$338,$AA$340,$AA$342,$AA$344,$AA$346,$AA$348,$AA$350,$AA$352,$AA$354,$AA$356,$AA$358,$AA$360,$AA$362,$AA$364,$AA$366,$AA$368,$AA$370,$AA$372,$AA$374,$AA$376,$AA$378,$AA$380,$AA$382,$AA$384,$AA$386,$AA$388,$AA$390,$AA$392,$AA$394,$AA$396,$AA$398,$AA$400,$AA$402,$AA$404,$AA$406,$AA$408,$AA$410,$AA$412,$AA$414,$AA$416,$AA$418,$AA$420,$AA$422,$AA$424,$AA$426,$AA$428,$AA$430,$AA$432,$AA$434,$AA$436,$AA$438,$AA$440,$AA$442,$AA$444,$AA$446,$AA$448,$AA$450,$AA$452,$AA$454,$AA$456,$AA$458,$AA$460,$AA$462,$AA$464,$AA$466,$AA$468,$AA$470,$AA$472,$AA$474,$AA$476,$AA$478,$AA$480,$AA$482,$AA$484,$AA$486,$AA$488,$AA$490,$AA$492,$AA$494,$AA$496,$AA$498,$AA$500,$AA$502,$AA$504,$AA$506,$AA$508,$AA$510,$AA$512,$AA$514,$AA$516,$AA$518,$AA$520)","v":0},"TOTAL HOURS",null,"\nTOTAL",{"$f":"SUM($AE$12,$AE$14,$AE$16,$AE$18,$AE$20,$AE$22,$AE$24,$AE$26,$AE$28,$AE$30,$AE$32,,$AE$42,$AE$44,$AE$46,$AE$48,$AE$50,$AE$52,$AE$54,$AE$56,$AE$58,$AE$60,$AE$62,$AE$64,$AE$66,$AE$68,$AE$70,$AE$72,$AE$74,$AE$76,$AE$78,$AE$80,$AE$82,$AE$84,$AE$86,$AE$88,$AE$90,$AE$92,$AE$94,$AE$96,$AE$98,$AE$100,$AE$102,$AE$104,$AE$106,$AE$108,$AE$110,$AE$112,$AE$114,$AE$116,$AE$118,$AE$120,$AE$122,$AE$124,$AE$126,$AE$128,$AE$130,$AE$132,$AE$134,$AE$136,$AE$138,$AE$140,$AE$142,$AE$144,$AE$146,$AE$148,$AE$150,$AE$152,$AE$154,$AE$156,$AE$158,$AE$160,$AE$162,$AE$164,$AE$166,$AE$168,$AE$170,$AE$172,$AE$174,$AE$176,$AE$178,$AE$180,$AE$182,$AE$184,$AE$186,$AE$188,$AE$190,$AE$192,$AE$194,$AE$196,$AE$198,$AE$200,$AE$202,$AE$204,$AE$206,$AE$208,$AE$210,$AE$212,$AE$214,$AE$216,$AE$218,$AE$220,$AE$222,$AE$224,$AE$226,$AE$228,$AE$230,$AE$232,$AE$234,$AE$236,$AE$238,$AE$240,$AE$242,$AE$244,$AE$246,$AE$248,$AE$250,$AE$252,$AE$254,$AE$256,$AE$258,$AE$260,$AE$262,$AE$264,$AE$266,$AE$268,$AE$270,$AE$272,$AE$274,$AE$276,$AE$278,$AE$280,$AE$282,$AE$284,$AE$286,$AE$288,$AE$290,$AE$292,$AE$294,$AE$296,$AE$298,$AE$300,$AE$302,$AE$304,$AE$306,$AE$308,$AE$310,$AE$312,$AE$314,$AE$316,$AE$318,$AE$320,$AE$322,$AE$324,$AE$326,$AE$328,$AE$330,$AE$332,$AE$334,$AE$336,$AE$338,$AE$340,$AE$342,$AE$344,$AE$346,$AE$348,$AE$350,$AE$352,$AE$354,$AE$356,$AE$358,$AE$360,$AE$362,$AE$364,$AE$366,$AE$368,$AE$370,$AE$372,$AE$374,$AE$376,$AE$378,$AE$380,$AE$382,$AE$384,$AE$386,$AE$388,$AE$390,$AE$392,$AE$394,$AE$396,$AE$398,$AE$400,$AE$402,$AE$404,$AE$406,$AE$408,$AE$410,$AE$412,$AE$414,$AE$416,$AE$418,$AE$420,$AE$422,$AE$424,$AE$426,$AE$428,$AE$430,$AE$432,$AE$434,$AE$436,$AE$438,$AE$440,$AE$442,$AE$444,$AE$446,$AE$448,$AE$450,$AE$452,$AE$454,$AE$456,$AE$458,$AE$460,$AE$462,$AE$464,$AE$466,$AE$468,$AE$470,$AE$472,$AE$474,$AE$476,$AE$478,$AE$480,$AE$482,$AE$484,$AE$486,$AE$488,$AE$490,$AE$492,$AE$494,$AE$496,$AE$498,$AE$500,$AE$502,$AE$504,$AE$506,$AE$508,$AE$510,$AE$512,$AE$514,$AE$516,$AE$518,$AE$520)","v":0}]
[null,null,null,null,null,null,null,null,null,null,null,null,null,null,null,null,null,null,null,null,null,null,null,null,null,null,{"$f":"SUM($AA$13,$AA$15,$AA$17,$AA$19,$AA$21,$AA$23,$AA$25,$AA$27,$AA$29,$AA$31,$AA$33,$AA$43,$AA$45,$AA$47,$AA$49,$AA$51,$AA$53,$AA$55,$AA$57,$AA$59,$AA$61,$AA$63,$AA$65,$AA$67,$AA$69,$AA$71,$AA$73,$AA$75,$AA$77,$AA$79,$AA$81,$AA$83,$AA$85,$AA$87,$AA$89,$AA$91,$AA$93,$AA$95,$AA$97,$AA$99,$AA$101,$AA$103,$AA$105,$AA$107,$AA$109,$AA$111,$AA$113,$AA$115,$AA$117,$AA$119,$AA$121,$AA$123,$AA$125,$AA$127,$AA$129,$AA$131,$AA$133,$AA$135,$AA$137,$AA$139,$AA$141,$AA$143,$AA$145,$AA$147,$AA$149,$AA$151,$AA$153,$AA$155,$AA$157,$AA$159,$AA$161,$AA$163,$AA$165,$AA$167,$AA$169,$AA$171,$AA$173,$AA$175,$AA$177,$AA$179,$AA$181,$AA$183,$AA$185,$AA$187,$AA$189,$AA$191,$AA$193,$AA$195,$AA$197,$AA$199,$AA$201,$AA$203,$AA$205,$AA$207,$AA$209,$AA$211,$AA$213,$AA$215,$AA$217,$AA$219,$AA$221,$AA$223,$AA$225,$AA$227,$AA$229,$AA$231,$AA$233,$AA$235,$AA$237,$AA$239,$AA$241,$AA$243,$AA$245,$AA$247,$AA$249,$AA$251,$AA$253,$AA$255,$AA$257,$AA$259,$AA$261,$AA$263,$AA$265,$AA$267,$AA$269,$AA$271,$AA$273,$AA$275,$AA$277,$AA$279,$AA$281,$AA$283,$AA$285,$AA$287,$AA$289,$AA$291,$AA$293,$AA$295,$AA$297,$AA$299,$AA$301,$AA$303,$AA$305,$AA$307,$AA$309,$AA$311,$AA$313,$AA$315,$AA$317,$AA$319,$AA$321,$AA$323,$AA$325,$AA$327,$AA$329,$AA$331,$AA$333,$AA$335,$AA$337,$AA$339,$AA$341,$AA$343,$AA$345,$AA$347,$AA$349,$AA$351,$AA$353,$AA$355,$AA$357,$AA$359,$AA$361,$AA$363,$AA$365,$AA$367,$AA$369,$AA$371,$AA$373,$AA$375,$AA$377,$AA$379,$AA$381,$AA$383,$AA$385,$AA$387,$AA$389,$AA$391,$AA$393,$AA$395,$AA$397,$AA$399,$AA$401,$AA$403,$AA$405,$AA$407,$AA$409,$AA$411,$AA$413,$AA$415,$AA$417,$AA$419,$AA$421,$AA$423,$AA$425,$AA$427,$AA$429,$AA$431,$AA$433,$AA$435,$AA$437,$AA$439,$AA$441,$AA$443,$AA$445,$AA$447,$AA$449,$AA$451,$AA$453,$AA$455,$AA$457,$AA$459,$AA$461,$AA$463,$AA$465,$AA$467,$AA$469,$AA$471,$AA$473,$AA$475,$AA$477,$AA$479,$AA$481,$AA$483,$AA$485,$AA$487,$AA$489,$AA$491,$AA$493,$AA$495,$AA$497,$AA$499,$AA$501,$AA$503,$AA$505,$AA$507,$AA$509,$AA$511,$AA$513,$AA$515,$AA$517,$AA$519,$AA$521,$AA$523,$AA$525)","v":0},"TOTAL OT HOURS",null,"OT TOTAL",{"$f":"SUM($AE$13,$AE$15,$AE$17,$AE$19,$AE$21,$AE$23,$AE$25,$AE$27,$AE$29,$AE$31,$AE$33,$AE$43,$AE$45,$AE$47,$AE$49,$AE$51,$AE$53,$AE$55,$AE$57,$AE$59,$AE$61,$AE$63,$AE$65,$AE$67,$AE$69,$AE$71,$AE$73,$AE$75,$AE$77,$AE$79,$AE$81,$AE$83,$AE$85,$AE$87,$AE$89,$AE$91,$AE$93,$AE$95,$AE$97,$AE$99,$AE$101,$AE$103,$AE$105,$AE$107,$AE$109,$AE$111,$AE$113,$AE$115,$AE$117,$AE$119,$AE$121,$AE$123,$AE$125,$AE$127,$AE$129,$AE$131,$AE$133,$AE$135,$AE$137,$AE$139,$AE$141,$AE$143,$AE$145,$AE$147,$AE$149,$AE$151,$AE$153,$AE$155,$AE$157,$AE$159,$AE$161,$AE$163,$AE$165,$AE$167,$AE$169,$AE$171,$AE$173,$AE$175,$AE$177,$AE$179,$AE$181,$AE$183,$AE$185,$AE$187,$AE$189,$AE$191,$AE$193,$AE$195,$AE$197,$AE$199,$AE$201,$AE$203,$AE$205,$AE$207,$AE$209,$AE$211,$AE$213,$AE$215,$AE$217,$AE$219,$AE$221,$AE$223,$AE$225,$AE$227,$AE$229,$AE$231,$AE$233,$AE$235,$AE$237,$AE$239,$AE$241,$AE$243,$AE$245,$AE$247,$AE$249,$AE$251,$AE$253,$AE$255,$AE$257,$AE$259,$AE$261,$AE$263,$AE$265,$AE$267,$AE$269,$AE$271,$AE$273,$AE$275,$AE$277,$AE$279,$AE$281,$AE$283,$AE$285,$AE$287,$AE$289,$AE$291,$AE$293,$AE$295,$AE$297,$AE$299,$AE$301,$AE$303,$AE$305,$AE$307,$AE$309,$AE$311,$AE$313,$AE$315,$AE$317,$AE$319,$AE$321,$AE$323,$AE$325,$AE$327,$AE$329,$AE$331,$AE$333,$AE$335,$AE$337,$AE$339,$AE$341,$AE$343,$AE$345,$AE$347,$AE$349,$AE$351,$AE$353,$AE$355,$AE$357,$AE$359,$AE$361,$AE$363,$AE$365,$AE$367,$AE$369,$AE$371,$AE$373,$AE$375,$AE$377,$AE$379,$AE$381,$AE$383,$AE$385,$AE$387,$AE$389,$AE$391,$AE$393,$AE$395,$AE$397,$AE$399,$AE$401,$AE$403,$AE$405,$AE$407,$AE$409,$AE$411,$AE$413,$AE$415,$AE$417,$AE$419,$AE$421,$AE$423,$AE$425,$AE$427,$AE$429,$AE$431,$AE$433,$AE$435,$AE$437,$AE$439,$AE$441,$AE$443,$AE$445,$AE$447,$AE$449,$AE$451,$AE$453,$AE$455,$AE$457,$AE$459,$AE$461,$AE$463,$AE$465,$AE$467,$AE$469,$AE$471,$AE$473,$AE$475,$AE$477,$AE$479,$AE$481,$AE$483,$AE$485,$AE$487,$AE$489,$AE$491,$AE$493,$AE$495,$AE$497,$AE$499,$AE$501,$AE$503,$AE$505,$AE$507,$AE$509,$AE$511,$AE$513,$AE$515,$AE$517,$AE$519,$AE$521,$AE$523,$AE$525)","v":0}]
[null,null,null,null,null,null,null,null,null,null,null,null,null,null,null,null,null,null,null,null,null,null,null,null,null,null,{"$f":"SUM(AA12:AA989)","v":0},"TOTAL HOURS",null,"TOTAL COST",{"$f":"SUM(AE12:AE41)","v":0}]
[null,null,null,null,null," "," "," "," "," "," "," "," "," "," "," "," "," "," "," "," "," "," "," "," "," ","RATES / COSTS",null,null,null,null,null,null,null,null,null,null,null,null,null,null,null,null,null,null,null,null,null,null,null,null,null,null,{"$f":"IF(ISBLANK(BB8),\"\",VLOOKUP(BB8,#REF!,2,0))","v":""}]
[null,null,null,null,null,null,null,null,null,null,null,null,null,null,null,null,null,null,null,null,null,null,null,null,null,null,"TOTAL HRS","HOURLY RATE","BENEFIT RATE","TOTAL HOURLY","TOTAL COST"]
{"$rows_left_out":32}
{"sheet":"LEMA EQUIPMENT","index":4,"n_rows":30,"n_cols":34,"rows_kept":30,"cut":false,"hidden":false,"merged":[[6,8,7,28],[6,1,7,7],[5,26,5,30],[2,1,2,30],[3,1,3,30],[4,23,4,25],[5,23,5,25],[4,26,4,30],[4,1,4,22],[5,1,5,22]]}
[null,null,null,null,null,null,null,"CalOES - Law Enforcement Mutual Aid Assistance (LEMA) Program "]
[]
[null,"  "]
[null,"FORCE ACCOUNT EQUIPMENT RECORD",null,null,null,null,null,null,null,null,null,null,null,null,null,null,null,null,null,null,null,null,null,null,null,null,null,null,null,null,null,null,null,"HR"]
[null,"APPLICANT",null,null,null,null,null,null,null,null,null,null,null,null,null,null,null,null,null,null,null,null,null,"CATEGORY",null,null,{"$f":"'FILL OUT FIRST - TOC'!E4","v":"Disaster Number (XXXX-DR-STATE):"},null,null,null,null,null,null,"MI"]
[null,{"$f":"'FILL OUT FIRST - TOC'!$F$5","v":0},null,null,null,null,null,null,null,null,null,null,null,null,null,null,null,null,null,null,null,null,null,{"$f":"'FILL OUT FIRST - TOC'!$F$6","v":"Law Enforcement Mutual Aid"},null,null,{"$f":"'FILL OUT FIRST - TOC'!$F$4","v":0}]
[null,"EQUIPMENT / OPERATOR INFORMATION",null,null,null,null,null,null,"DATES / HOURS/MILEAGE USED EACH DAY",null,null,null,null,null,null,null,null,null,null,null,null,null,null,null,null,null,null,null,null,"TOTAL","TOTAL"]
[null,null,null,null,null,null,null,null,null,null,null,null,null,null,null,null,null,null,null,null,null,null,null,null,null,null,null,null,null,"HOURS","COST"]
[null,"Equipment Name \n(Unit Number, Make, Model)","Operator's Name","HP","Capacity","Unit","Equip. Code #","Equip. Rate"," "," "," "," "," "," "," "," "," "," "," "," "," "," "," "," "," "," "," "," "," ",{"$f":"SUM(AD10:AD989)","v":0},{"$f":"SUM(AE10:AE989)","v":0}]
[null," "," "," "," ","MI",null,0.7,null,null,null,null,null,null,null,null,null," ",null,null,null,null,null,null,null,null,null,null,null,{"$f":"SUM(I10:AC10)","v":0},{"$f":"H10*AD10","v":0}]
{"$rows_left_out":21}
{"sheet":"RA EQUIPMENT","index":5,"n_rows":29,"n_cols":34,"rows_kept":29,"cut":false,"hidden":false,"merged":[[5,1,6,7],[5,8,6,28],[1,1,1,30],[2,1,2,30],[3,1,3,22],[3,23,3,25],[3,26,3,30],[4,1,4,22],[4,23,4,25],[4,26,4,30]]}
[]
[null,"  "]
[null,"FORCE ACCOUNT EQUIPMENT RECORD",null,null,null,null,null,null,null,null,null,null,null,null,null,null,null,null,null,null,null,null,null,null,null,null,null,null,null,null,null,null,null,"HR"]
[null,"APPLICANT",null,null,null,null,null,null,null,null,null,null,null,null,null,null,null,null,null,null,null,null,null,"CATEGORY",null,null,{"$f":"'FILL OUT FIRST - TOC'!E4","v":"Disaster Number (XXXX-DR-STATE):"},null,null,null,null,null,null,"MI"]
[null,{"$f":"'FILL OUT FIRST - TOC'!$F$5","v":0},null,null,null,null,null,null,null,null,null,null,null,null,null,null,null,null,null,null,null,null,null,{"$f":"'FILL OUT FIRST - TOC'!$F$6","v":"Law Enforcement Mutual Aid"},null,null,{"$f":"'FILL OUT FIRST - TOC'!$F$4","v":0}]
[null,"EQUIPMENT / OPERATOR INFORMATION",null,null,null,null,null,null,"DATES / HOURS/MILEAGE USED EACH DAY",null,null,null,null,null,null,null,null,null,null,null,null,null,null,null,null,null,null,null,null,"TOTAL","TOTAL"]
[null,null,null,null,null,null,null,null,null,null,null,null,null,null,null,null,null,null,null,null,null,null,null,null,null,null,null,null,null,"HOURS","COST"]
[null,"Equipment Name \n(Unit Number, Make, Model)","Operator's Name","HP","Capacity","Unit","Equip. Code #","Equip. Rate"," "," "," "," "," "," "," "," "," "," "," "," "," "," "," "," "," "," "," "," "," ",{"$f":"SUM(AD9:AD988)","v":0},{"$f":"SUM(AE9:AE988)","v":0}]
[null," "," "," "," ","MI",null,0.68,null,null,null,null,null,null,null,null,null," ",null,null,null,null,null,null,null,null,null,null,null,{"$f":"SUM(I9:AC9)","v":0},{"$f":"H9*AD9","v":0}]
[null," "," "," "," ","MI",null,null,null,null,null,null,null,null,null,null,null,null," ",null,null,null,null,null,null,null,null,null,null,{"$f":"SUM(I10:AC10)","v":0},0]
{"$rows_left_out":20}
{"sheet":"FEMA EQUIP.RATES","index":6,"n_rows":555,"n_cols":9,"rows_kept":555,"cut":false,"hidden":false,"merged":[[438,7,439,7],[438,8,439,8],[441,0,442,0],[441,1,442,1],[441,3,442,3],[441,4,442,4],[441,5,442,5],[441,6,442,6],[441,7,442,7],[441,8,442,8],[438,0,439,0],[438,1,439,1],[438,2,439,2],[438,4,439,4],[438,5,439,5],[438,6,439,6],[238,7,239,7],[238,8,239,8],[434,0,435,0],[434,1,435,1],[434,2,435,2],[434,4,435,4],[434,5,435,5],[434,6,435,6],[434,7,435,7],[434,8,435,8],[238,0,239,0],[238,1,239,1],[238,2,239,2],[238,4,239,4],[238,5,239,5],[238,6,239,6],[0,0,0,8],[153,0,154,0],[153,1,154,1],[153,2,154,2],[153,3,154,3],[153,4,154,4],[153,5,154,5],[153,7,154,7],[153,8,154,8]]}
["FEMA EQUIPMENT RATES 2023-2025"]
[null,"A","B","C","D","E","F","G","H"]
[null,"Cost Code","Equipment","Specifications/Manufacturer","Capacity or Size","HP","Notes","Unit","2023 Rates"]
[1,8010,"Air Compressor","Miscellaneous Tank Mounted Air Compressors\n80/25","41 CFM","to 10","Hoses included","hour",1.28]
[2,8011,"Air Compressor","Multiquip DIS100SSK4F","103 CFM","to 30","Hoses included","hour",20.32]
[3,8012,"Air Compressor","Sullivan-Palatek D130Q6IZ","130 CFM","to 50","Hoses included","hour",28.56]
[4,8013,"Air Compressor","Grimmer-Schmidt 175","175 CFM","to 90","Hoses included","hour",31.69]
[5,8014,"Air Compressor","Sullivan-Palatek D375QH6CA","400 CFM","to 145","Hoses included","hour",68.709999999999994]
[6,8015,"Air Compressor","Grimmer-Schmidt 800","575 CFM","to 230","Hoses included","hour",108.12]
[7,8016,"Air Compressor","Ingersoll Rand XP1200WCU","1100 CFM","to 355","Hoses included","hour",172.25]
{"$rows_left_out":546}
{"sheet":"LEMA PER DIEM RATES","index":7,"n_rows":38,"n_cols":2,"rows_kept":38,"cut":false,"hidden":false,"merged":[[0,0,0,1],[2,0,2,1],[3,0,3,1],[4,0,4,1],[17,0,17,1]]}
["LEMA Per Diem Rates 2024-2025"]
[]
["MEALS AND INCIDENTAL RATES"]
["The following reimbursement rates for meals and incidentals are maximums, not allowances.  In the event of an audit, must be able to produce receipts substantiating the amount claimed."]
["HR Manual section 2203 – Allowances and Travel Reimbursements provides additional information, including travel timeframes (fractional day of travel, trip of less than 24 hours, trip of more than 24 hours, etc.)."]
["Meal and Incidental Expense Category​","​Effective October 1, 2024: Reimbursement Rate for Actual Expense​"]
["​Breakfast","Up to $16"]
["​Lunch","​Up to $19"]
["​Dinner","​Up to $28"]
["​Incidentals​","​Up to $5"]
{"$rows_left_out":29}
{"sheet":"LEMA MATERIALS","index":8,"n_rows":7,"n_cols":10,"rows_kept":7,"cut":false,"hidden":false,"merged":[[3,1,3,4],[4,1,4,4],[1,1,1,9],[2,1,2,9],[5,1,6,1],[5,2,6,2],[5,5,6,5],[5,6,6,6],[5,7,5,8],[5,9,6,9],[4,7,4,9],[3,7,3,9],[4,5,4,6],[3,5,3,6]]}
[null,null,null,"CalOES - Law Enforcement Mutual Aid Assistance (LEMA) Program "]
[null," "]
[null,"FORCE ACCOUNT MATERIALS SUMMARY RECORD"]
[null,"APPLICANT",null,null,null,"CATEGORY",null,{"$f":"'FILL OUT FIRST - TOC'!E4","v":"Disaster Number (XXXX-DR-STATE):"}]
[null,{"$f":"'FILL OUT FIRST - TOC'!$F$5","v":0},null,null,null,{"$f":"'FILL OUT FIRST - TOC'!$F$6","v":"Law Enforcement Mutual Aid"},null,{"$f":"'FILL OUT FIRST - TOC'!$F$4","v":0}]
[null,"Vendor","Description","Total Invoiced Amount","Total \nClaimed Amount","Date Purchased","Date Used","Source of Data",null,"Comments"]
[null,null,null,{"$f":"SUM(D8:D996)","v":0},{"$f":"SUM(E8:E996)","v":0},null,null,"Invoice #","Stock"]

{"sheet":"RA MATERIALS","index":9,"n_rows":6,"n_cols":10,"rows_kept":6,"cut":false,"hidden":false,"merged":[[4,9,5,9],[0,1,0,9],[1,1,1,9],[2,1,2,4],[2,5,2,6],[2,7,2,9],[3,1,3,4],[3,5,3,6],[3,7,3,9],[4,1,5,1],[4,2,5,2],[4,5,5,5],[4,6,5,6],[4,7,4,8]]}
[null," "]
[null,"FORCE ACCOUNT MATERIALS SUMMARY RECORD"]
[null,"APPLICANT",null,null,null,"CATEGORY",null,{"$f":"'FILL OUT FIRST - TOC'!E4","v":"Disaster Number (XXXX-DR-STATE):"}]
[null,{"$f":"'FILL OUT FIRST - TOC'!$F$5","v":0},null,null,null,{"$f":"'FILL OUT FIRST - TOC'!$F$6","v":"Law Enforcement Mutual Aid"},null,{"$f":"'FILL OUT FIRST - TOC'!$F$4","v":0}]
[null,"Vendor","Description","Total Invoiced Amount","Total \nClaimed Amount","Date Purchased","Date Used","Source of Data",null,"Comments"]
[null,null,null,{"$f":"SUM(D7:D995)","v":0},{"$f":"SUM(E7:E995)","v":0},null,null,"Invoice #","Stock"]

{"sheet":"COST SUMMARY ROLL-UP","index":10,"n_rows":22,"n_cols":10,"rows_kept":22,"cut":false,"hidden":false,"merged":[[1,2,1,9],[3,2,3,9],[2,2,2,9],[8,4,8,8],[6,4,6,8],[4,8,4,9],[5,6,5,7],[4,6,4,7],[7,4,7,8],[5,8,5,9],[4,2,4,5],[5,2,5,5],[9,4,9,8],[10,4,10,8],[11,4,11,8],[12,4,12,8],[13,4,13,8],[22,2,30,9],[21,2,21,9],[19,8,20,9],[16,2,17,9],[14,4,14,8],[15,4,15,8],[18,2,18,7],[18,8,18,9],[19,2,20,7]]}
[]
[null,null,"CalOES - Law Enforcement Mutual Aid Assistance (LEMA) Program"]
[null,null," "]
[null,null,"COST SUMMARY ROLL-UP"]
[null,null,"APPLICANT",null,null,null,"CATEGORY",null,{"$f":"'FILL OUT FIRST - TOC'!E4","v":"Disaster Number (XXXX-DR-STATE):"}]
[null,null,{"$f":"'FILL OUT FIRST - TOC'!$F$5","v":0},null,null,null,{"$f":"'FILL OUT FIRST - TOC'!$F$6","v":"Law Enforcement Mutual Aid"},null,{"$f":"'FILL OUT FIRST - TOC'!$F$4","v":0}]
[null,null,"CATEGORY","CLAIM COST","          COMMENTS",null,null,null,null,"ELIGIBLE COSTS"]
[null,null,"FORCE ACCOUNT LABOR OVERTIME TIME",{"$f":"LABOR!AE7","v":0},null,null,null,null,null,{"$f":"LABOR!AE7","v":0}]
[null,null,"FORCE ACCOUNT LEMA EQUIPMENT",{"$f":"'LEMA EQUIPMENT'!AE9","v":0},null,null,null,null,null,{"$f":"'LEMA EQUIPMENT'!AE9","v":0}]
[null,null,"LEMA MATERIALS",{"$f":"'LEMA MATERIALS'!D7","v":0},null,null,null,null,null,{"$f":"'LEMA MATERIALS'!E7","v":0}]
{"$rows_left_out":13}
{"sheet":"LEMA INVOICE","index":11,"n_rows":22,"n_cols":5,"rows_kept":22,"cut":false,"hidden":false,"merged":[[20,1,20,4],[21,1,21,4],[0,3,0,4],[7,3,7,4],[13,1,13,2],[14,1,14,2]]}
[null,"Add Logo",null,"INVOICE"]
[null,{"$f":"'FILL OUT FIRST - TOC'!F10","v":" "}]
[null,{"$f":"'FILL OUT FIRST - TOC'!F11","v":" "}]
[null,{"$f":"'FILL OUT FIRST - TOC'!F12","v":" "},null,"INVOICE NO."," "]
[null,{"$f":"'FILL OUT FIRST - TOC'!F13","v":" "},null,"DATE"," "]
[null,{"$f":"'FILL OUT FIRST - TOC'!F14","v":" "},null,"RESOURCE TYPE"]
[null,{"$f":"'FILL OUT FIRST - TOC'!F15","v":" "}]
[null,"TO:                        CalOES - Law Enforcement Branch"]
[null,"3650 Schriever Ave"]
[null,"Mather, CA.  95655"]
{"$rows_left_out":13}
{"sheet":"RA INVOICE","index":12,"n_rows":22,"n_cols":5,"rows_kept":22,"cut":false,"hidden":false,"merged":[[21,1,21,4],[0,3,0,4],[7,3,7,4],[13,1,13,2],[14,1,14,2],[20,1,20,4]]}
[null,"Add Logo",null,"INVOICE"]
[null,{"$f":"'FILL OUT FIRST - TOC'!F10","v":" "}]
[null,{"$f":"'FILL OUT FIRST - TOC'!F11","v":" "}]
[null,{"$f":"'FILL OUT FIRST - TOC'!F12","v":" "},null,"INVOICE NO."," "]
[null,{"$f":"'FILL OUT FIRST - TOC'!F13","v":" "},null,"DATE"," "]
[null,{"$f":"'FILL OUT FIRST - TOC'!F14","v":" "},null,"RESOURCE TYPE"]
[null,{"$f":"'FILL OUT FIRST - TOC'!F15","v":" "}]
[null,"TO:                        "]
[]
[]
{"$rows_left_out":13}
{"sheet":"List Selections","index":13,"n_rows":6,"n_cols":1,"rows_kept":6,"cut":false,"hidden":true,"merged":[]}
[]
["Emergency Management Mutual Aid"]
["Law Enforcement Mutual Aid"]
["Public Health Mutual Aid"]
["EMS Mutual Aid"]
["Other Specify Below"]